Reaction Details
TargetMitogen-activated protein kinase 14
LigandBDBM50430377
Substrate/Competitorn/a
Meas. Tech.ChEMBL_943804 (CHEMBL2346253)
IC50>1000±n/a nM
Citation Chowdhury, SChen, YTFang, XGrant, WPocas, JCameron, MDRuiz, CLin, LPark, HSchröter, TBannister, TDLograsso, PVFeng, Y Amino acid derived quinazolines as Rock/PKA inhibitors. Bioorg Med Chem Lett23:1592-9 (2013) 
 
Mitogen-activated protein kinase 14
Name:Mitogen-activated protein kinase 14
Type:Serine/threonine-protein kinase
Mol. Mass.:41286.76
Organism:Homo sapiens (Human)
Description:Q16539
Residue:360
BDBM50430377
NameBDBM50430377
Synonyms:CHEMBL2333898
TypeSmall organic molecule
Emp. Form.C21H18ClN5O
Mol. Mass.391.854
SMILESClc1ccc(cc1)[C@@H]1CNC[C@H]1c1nc2ccc(cc2c(=O)[nH]1)-c1cn[nH]c1