Reaction Details
TargetRho-associated protein kinase 1
LigandBDBM50430371
Substrate/Competitorn/a
Meas. Tech.ChEMBL_943815 (CHEMBL2346264)
IC50 17±n/a nM
Citation Chowdhury, SChen, YTFang, XGrant, WPocas, JCameron, MDRuiz, CLin, LPark, HSchröter, TBannister, TDLograsso, PVFeng, Y Amino acid derived quinazolines as Rock/PKA inhibitors. Bioorg Med Chem Lett23:1592-9 (2013) 
 
Rho-associated protein kinase 1
Name:Rho-associated protein kinase 1
Type:Serine/threonine-protein kinase
Mol. Mass.:158156.77
Organism:Homo sapiens (Human)
Description:Q13464
Residue:1354
BDBM50430371
NameBDBM50430371
Synonyms:CHEMBL2333905
TypeSmall organic molecule
Emp. Form.C19H16FN5O
Mol. Mass.349.3616
SMILESN[C@@H](Cc1ccc(F)cc1)c1nc2ccc(cc2c(=O)[nH]1)-c1cn[nH]c1