Reaction Details
TargetMitogen-activated protein kinase 14
LigandBDBM50430368
Substrate/Competitorn/a
Meas. Tech.ChEMBL_943804 (CHEMBL2346253)
IC50>1000±n/a nM
Citation Chowdhury, SChen, YTFang, XGrant, WPocas, JCameron, MDRuiz, CLin, LPark, HSchröter, TBannister, TDLograsso, PVFeng, Y Amino acid derived quinazolines as Rock/PKA inhibitors. Bioorg Med Chem Lett23:1592-9 (2013) 
 
Mitogen-activated protein kinase 14
Name:Mitogen-activated protein kinase 14
Type:Serine/threonine-protein kinase
Mol. Mass.:41286.76
Organism:Homo sapiens (Human)
Description:Q16539
Residue:360
BDBM50430368
NameBDBM50430368
Synonyms:CHEMBL2333908
TypeSmall organic molecule
Emp. Form.C20H18FN5O2
Mol. Mass.379.3876
SMILESCOc1cc(cc2c1nc([nH]c2=O)[C@H](N)Cc1cccc(F)c1)-c1cn[nH]c1