Reaction Details
TargetMitogen-activated protein kinase 14
LigandBDBM50430374
Substrate/Competitorn/a
Meas. Tech.ChEMBL_943804 (CHEMBL2346253)
IC50>1000±n/a nM
Citation Chowdhury, SChen, YTFang, XGrant, WPocas, JCameron, MDRuiz, CLin, LPark, HSchröter, TBannister, TDLograsso, PVFeng, Y Amino acid derived quinazolines as Rock/PKA inhibitors. Bioorg Med Chem Lett23:1592-9 (2013) 
 
Mitogen-activated protein kinase 14
Name:Mitogen-activated protein kinase 14
Type:Serine/threonine-protein kinase
Mol. Mass.:41286.76
Organism:Homo sapiens (Human)
Description:Q16539
Residue:360
BDBM50430374
NameBDBM50430374
Synonyms:CHEMBL2334292
TypeSmall organic molecule
Emp. Form.C21H19N5O
Mol. Mass.357.4085
SMILESO=c1[nH]c(nc2ccc(cc12)-c1cn[nH]c1)[C@@H]1CNC[C@H]1c1ccccc1