Reaction Details
TargetMitogen-activated protein kinase 8
LigandBDBM50430367
Substrate/Competitorn/a
Meas. Tech.ChEMBL_943807 (CHEMBL2346256)
IC50>1000±n/a nM
Citation Chowdhury, SChen, YTFang, XGrant, WPocas, JCameron, MDRuiz, CLin, LPark, HSchröter, TBannister, TDLograsso, PVFeng, Y Amino acid derived quinazolines as Rock/PKA inhibitors. Bioorg Med Chem Lett23:1592-9 (2013) 
 
Mitogen-activated protein kinase 8
Name:Mitogen-activated protein kinase 8
Type:Enzyme
Mol. Mass.:48297.57
Organism:Homo sapiens (Human)
Description:JNK-1 was purchased from Upstate Cell Signaling Solutions (formerly Upstate Biotechnology).
Residue:427
BDBM50430367
NameBDBM50430367
Synonyms:CHEMBL2333909
TypeSmall organic molecule
Emp. Form.C20H19N5O2
Mol. Mass.361.3972
SMILESCOc1ccc(C[C@H](N)c2nc3ccc(cc3c(=O)[nH]2)-c2cn[nH]c2)cc1