Reaction Details
TargetMitogen-activated protein kinase 10
LigandBDBM50430432
Substrate/Competitorn/a
Meas. Tech.ChEMBL_944323 (CHEMBL2344423)
Kd 46±n/a nM
Citation Kim, MHRyu, JSHah, JM 3D-QSAR studies of 1,2-diaryl-1H-benzimidazole derivatives as JNK3 inhibitors with protective effects in neuronal cells. Bioorg Med Chem Lett23:1639-42 (2013) 
 
Mitogen-activated protein kinase 10
Name:Mitogen-activated protein kinase 10
Type:Enzyme
Mol. Mass.:52586.89
Organism:Homo sapiens (Human)
Description:n/a
Residue:464
BDBM50430432
NameBDBM50430432
Synonyms:CHEMBL2334705
TypeSmall organic molecule
Emp. Form.C30H28N6O2
Mol. Mass.504.5823
SMILESOc1ccc2nc(-c3ccc4ccccc4c3)n(-c3ccnc(N[C@@H]4CCCN(C4)C(=O)C4CC4)n3)c2c1