Reaction Details
TargetAcetylcholinesterase
LigandBDBM8963
Substrate/Competitorn/a
Meas. Tech.ChEMBL_946316 (CHEMBL2345931)
IC50 4.1±n/a nM
Citation da Costa, JSLopes, JPRussowsky, DPetzhold, CLBorges, ACCeschi, MAKonrath, EBatassini, CLunardi, PSGonçalves, CA Synthesis of tacrine-lophine hybrids via one-pot four component reaction and biological evaluation as acetyl- and butyrylcholinesterase inhibitors. Eur J Med Chem62:556-63 (2013) 
 
Acetylcholinesterase
Name:Acetylcholinesterase
Type:Enzyme
Mol. Mass.:68193.62
Organism:Rattus norvegicus (rat)
Description:P37136
Residue:614
BDBM8963
NameBDBM8963
Synonyms:CHEMBL32823 N-[7-(1,2,3,4-tetrahydroacridin-9-ylamino)heptyl]-1,2,3,4-tetrahydroacridin-9-amine Tacrine-Based Inhibitor 2f | tacrine homobivalent compound 3a
TypeSmall organic molecule
Emp. Form.C33H40N4
Mol. Mass.492.6975
SMILESC(CCCNc1c2CCCCc2nc2ccccc12)CCCNc1c2CCCCc2nc2ccccc12