Reaction Details
TargetD(3) dopamine receptor
LigandBDBM55121
Substrate/Competitorn/a
Meas. Tech.ChEMBL_946369 (CHEMBL2346423)
Ki 21±n/a nM
Citation Sanna, FOrtner, BHübner, HLöber, STschammer, NGmeiner, P Discovery of dopamine D4 receptor antagonists with planar chirality. Bioorg Med Chem21:1680-4 (2013) 
 
D(3) dopamine receptor
Name:D(3) dopamine receptor
Type:n/a
Mol. Mass.:44243.43
Organism:Homo sapiens (Human)
Description:n/a
Residue:400
BDBM55121
NameBDBM55121
Synonyms:3-HYDROXYTYRAMINE HYDROCHLORIDE 4-(2-aminoethyl)pyrocatechol;hydrochloride Dopamine SMR000059081 | cid_65340
TypeSmall organic molecule
Emp. Form.C8H11NO2
Mol. Mass.153.1784
SMILESNCCc1ccc(O)c(O)c1