Reaction Details
TargetEpidermal growth factor receptor
LigandBDBM50430566
Substrate/Competitorn/a
Meas. Tech.ChEMBL_946792 (CHEMBL2344596)
IC50 114700±n/a nM
Citation Gangjee, AZaware, NRaghavan, SDisch, BCThorpe, JEBastian, AIhnat, MA Synthesis and biological activity of 5-chloro-N4-substituted phenyl-9H-pyrimido[4,5-b]indole-2,4-diamines as vascular endothelial growth factor receptor-2 inhibitors and antiangiogenic agents. Bioorg Med Chem21:1857-64 (2013) 
 
Epidermal growth factor receptor
Name:Epidermal growth factor receptor
Type:Receptor Kinase Domain
Mol. Mass.:134279.59
Organism:Homo sapiens (Human)
Description:P00533
Residue:1210
BDBM50430566
NameBDBM50430566
Synonyms:CHEMBL2337367
TypeSmall organic molecule
Emp. Form.C21H20ClN5O
Mol. Mass.393.869
SMILESCC(C)(C)C(=O)Nc1nc(Nc2ccccc2)c2c(n1)[nH]c1cccc(Cl)c21