Reaction Details
TargetEpidermal growth factor receptor
LigandBDBM50430572
Substrate/Competitorn/a
Meas. Tech.ChEMBL_946792 (CHEMBL2344596)
IC50>200000±n/a nM
Citation Gangjee, AZaware, NRaghavan, SDisch, BCThorpe, JEBastian, AIhnat, MA Synthesis and biological activity of 5-chloro-N4-substituted phenyl-9H-pyrimido[4,5-b]indole-2,4-diamines as vascular endothelial growth factor receptor-2 inhibitors and antiangiogenic agents. Bioorg Med Chem21:1857-64 (2013) 
 
Epidermal growth factor receptor
Name:Epidermal growth factor receptor
Type:Receptor Kinase Domain
Mol. Mass.:134279.59
Organism:Homo sapiens (Human)
Description:P00533
Residue:1210
BDBM50430572
NameBDBM50430572
Synonyms:CHEMBL2337374
TypeSmall organic molecule
Emp. Form.C16H12ClN5
Mol. Mass.309.753
SMILESNc1nc(Nc2ccccc2)c2c(n1)[nH]c1cccc(Cl)c21