Reaction Details
TargetVascular endothelial growth factor receptor 2
LigandBDBM50430562
Substrate/Competitorn/a
Meas. Tech.ChEMBL_946793 (CHEMBL2344597)
IC50 31200±n/a nM
Citation Gangjee, AZaware, NRaghavan, SDisch, BCThorpe, JEBastian, AIhnat, MA Synthesis and biological activity of 5-chloro-N4-substituted phenyl-9H-pyrimido[4,5-b]indole-2,4-diamines as vascular endothelial growth factor receptor-2 inhibitors and antiangiogenic agents. Bioorg Med Chem21:1857-64 (2013) 
 
Vascular endothelial growth factor receptor 2
Name:Vascular endothelial growth factor receptor 2
Type:Receptor Tyrosine Kinase
Mol. Mass.:151510.97
Organism:Homo sapiens (Human)
Description:P35968
Residue:1356
BDBM50430562
NameBDBM50430562
Synonyms:CHEMBL2337371
TypeSmall organic molecule
Emp. Form.C21H19ClFN5O
Mol. Mass.411.86
SMILESCC(C)(C)C(=O)Nc1nc(Nc2cccc(F)c2)c2c(n1)[nH]c1cccc(Cl)c21