Reaction Details
TargetVascular endothelial growth factor receptor 2
LigandBDBM50430564
Substrate/Competitorn/a
Meas. Tech.ChEMBL_946793 (CHEMBL2344597)
IC50 21300±n/a nM
Citation Gangjee, AZaware, NRaghavan, SDisch, BCThorpe, JEBastian, AIhnat, MA Synthesis and biological activity of 5-chloro-N4-substituted phenyl-9H-pyrimido[4,5-b]indole-2,4-diamines as vascular endothelial growth factor receptor-2 inhibitors and antiangiogenic agents. Bioorg Med Chem21:1857-64 (2013) 
 
Vascular endothelial growth factor receptor 2
Name:Vascular endothelial growth factor receptor 2
Type:Receptor Tyrosine Kinase
Mol. Mass.:151510.97
Organism:Homo sapiens (Human)
Description:P35968
Residue:1356
BDBM50430564
NameBDBM50430564
Synonyms:CHEMBL2337369
TypeSmall organic molecule
Emp. Form.C21H19Cl2N5O
Mol. Mass.428.314
SMILESCC(C)(C)C(=O)Nc1nc(Nc2ccc(Cl)cc2)c2c(n1)[nH]c1cccc(Cl)c21