Reaction Details
TargetVascular endothelial growth factor receptor 2
LigandBDBM50430570
Substrate/Competitorn/a
Meas. Tech.ChEMBL_946793 (CHEMBL2344597)
IC50 13200±n/a nM
Citation Gangjee, AZaware, NRaghavan, SDisch, BCThorpe, JEBastian, AIhnat, MA Synthesis and biological activity of 5-chloro-N4-substituted phenyl-9H-pyrimido[4,5-b]indole-2,4-diamines as vascular endothelial growth factor receptor-2 inhibitors and antiangiogenic agents. Bioorg Med Chem21:1857-64 (2013) 
 
Vascular endothelial growth factor receptor 2
Name:Vascular endothelial growth factor receptor 2
Type:Receptor Tyrosine Kinase
Mol. Mass.:151510.97
Organism:Homo sapiens (Human)
Description:P35968
Residue:1356
BDBM50430570
NameBDBM50430570
Synonyms:CHEMBL2337363
TypeSmall organic molecule
Emp. Form.C16H11Cl2N5
Mol. Mass.344.198
SMILESNc1nc(Nc2ccc(Cl)cc2)c2c(n1)[nH]c1cccc(Cl)c21