Reaction Details
TargetKappa-type opioid receptor
LigandBDBM50430604
Substrate/Competitorn/a
Meas. Tech.ChEMBL_947794 (CHEMBL2342213)
IC50 12±n/a nM
Citation Greedy, BMBradbury, FThomas, MPGrivas, KCami-Kobeci, GArchambeau, ABosse, KClark, MJAceto, MLewis, JWTraynor, JRHusbands, SM Orvinols with mixed kappa/mu opioid receptor agonist activity. J Med Chem56:3207-16 (2013) 
 
Kappa-type opioid receptor
Name:Kappa-type opioid receptor
Type:G Protein-Coupled Receptor (GPCR)
Mol. Mass.:42744.99
Organism:Cavia porcellus (domestic guinea pig)
Description:P41144
Residue:380
BDBM50430604
NameBDBM50430604
Synonyms:CHEMBL2338755
TypeSmall organic molecule
Emp. Form.C30H43NO4
Mol. Mass.481.6667
SMILESCCCCC[C@@](C)(O)[C@H]1C[C@]23CC[C@]1(OC)[C@@H]1Oc4c5c(C[C@H]2N(CC2CC2)CC[C@@]315)ccc4O