Reaction Details
TargetMu-type opioid receptor
LigandBDBM50430602
Substrate/Competitorn/a
Meas. Tech.ChEMBL_948260 (CHEMBL2340178)
Ki 0.600000±n/a nM
Citation Greedy, BMBradbury, FThomas, MPGrivas, KCami-Kobeci, GArchambeau, ABosse, KClark, MJAceto, MLewis, JWTraynor, JRHusbands, SM Orvinols with mixed kappa/mu opioid receptor agonist activity. J Med Chem56:3207-16 (2013) 
 
Mu-type opioid receptor
Name:Mu-type opioid receptor
Type:Enzyme Catalytic Domain
Mol. Mass.:11165.58
Organism:GUINEA PIG
Description:P97266
Residue:98
BDBM50430602
NameBDBM50430602
Synonyms:CHEMBL2338743
TypeSmall organic molecule
Emp. Form.C28H39NO4
Mol. Mass.453.6136
SMILESCO[C@]12CC[C@@]3(C[C@@H]1[C@](C)(O)C(C)C)[C@H]1Cc4ccc(O)c5O[C@@H]2[C@]3(CCN1CC1CC1)c45