Reaction Details
TargetKappa-type opioid receptor
LigandBDBM50430626
Substrate/Competitorn/a
Meas. Tech.ChEMBL_947794 (CHEMBL2342213)
Ki 1.2±n/a nM
Citation Greedy, BMBradbury, FThomas, MPGrivas, KCami-Kobeci, GArchambeau, ABosse, KClark, MJAceto, MLewis, JWTraynor, JRHusbands, SM Orvinols with mixed kappa/mu opioid receptor agonist activity. J Med Chem56:3207-16 (2013) 
 
Kappa-type opioid receptor
Name:Kappa-type opioid receptor
Type:G Protein-Coupled Receptor (GPCR)
Mol. Mass.:42744.99
Organism:Cavia porcellus (domestic guinea pig)
Description:P41144
Residue:380
BDBM50430626
NameBDBM50430626
Synonyms:CHEMBL2338754
TypeSmall organic molecule
Emp. Form.C28H39NO4
Mol. Mass.453.6136
SMILESCCC[C@@](C)(O)[C@H]1C[C@]23CC[C@]1(OC)[C@@H]1Oc4c5c(C[C@H]2N(CC2CC2)CC[C@@]315)ccc4O