Reaction Details
TargetKappa-type opioid receptor
LigandBDBM50430613
Substrate/Competitorn/a
Meas. Tech.ChEMBL_948257 (CHEMBL2340175)
Ki 0.086000±n/a nM
Citation Greedy, BMBradbury, FThomas, MPGrivas, KCami-Kobeci, GArchambeau, ABosse, KClark, MJAceto, MLewis, JWTraynor, JRHusbands, SM Orvinols with mixed kappa/mu opioid receptor agonist activity. J Med Chem56:3207-16 (2013) 
 
Kappa-type opioid receptor
Name:Kappa-type opioid receptor
Type:G Protein-Coupled Receptor (GPCR)
Mol. Mass.:42648.76
Organism:Homo sapiens (Human)
Description:P41145
Residue:380
BDBM50430613
NameBDBM50430613
Synonyms:CHEMBL2338723
TypeSmall organic molecule
Emp. Form.C30H41NO4
Mol. Mass.479.6508
SMILESCO[C@]12CC[C@@]3(C[C@@H]1[C@@H](O)CC1CCCC1)[C@H]1Cc4ccc(O)c5O[C@@H]2[C@]3(CCN1CC1CC1)c45