Reaction Details
TargetMu-type opioid receptor
LigandBDBM50430592
Substrate/Competitorn/a
Meas. Tech.ChEMBL_948258 (CHEMBL2340176)
Ki 0.310000±n/a nM
Citation Greedy, BMBradbury, FThomas, MPGrivas, KCami-Kobeci, GArchambeau, ABosse, KClark, MJAceto, MLewis, JWTraynor, JRHusbands, SM Orvinols with mixed kappa/mu opioid receptor agonist activity. J Med Chem56:3207-16 (2013) 
 
Mu-type opioid receptor
Name:Mu-type opioid receptor
Type:G Protein-Coupled Receptor (GPCR)
Mol. Mass.:44503.11
Organism:Rattus norvegicus (rat)
Description:Competition binding assays were carried out using membrane preparations from transfected HN9.10 cells that constitutively expressed the mu opioid receptor.
Residue:398
BDBM50430592
NameBDBM50430592
Synonyms:CHEMBL2338740
TypeSmall organic molecule
Emp. Form.C29H39NO4
Mol. Mass.465.6243
SMILESCO[C@]12CC[C@@]3(C[C@@H]1[C@H](O)C1CCCC1)[C@H]1Cc4ccc(O)c5O[C@@H]2[C@]3(CCN1CC1CC1)c45