Reaction Details
TargetAminopeptidase N
LigandBDBM50430635
Substrate/Competitorn/a
Meas. Tech.ChEMBL_942089 (CHEMBL2340787)
IC50 530±n/a nM
Citation Ma, CJin, KCao, JZhang, LLi, XXu, W Novel leucine ureido derivatives as inhibitors of aminopeptidase N (APN). Bioorg Med Chem21:1621-7 (2013) 
 
Aminopeptidase N
Name:Aminopeptidase N
Type:PROTEIN
Mol. Mass.:109522.63
Organism:Homo sapiens (Human)
Description:ChEMBL_1507526
Residue:967
BDBM50430635
NameBDBM50430635
Synonyms:CHEMBL2332525
TypeSmall organic molecule
Emp. Form.C13H18BrN3O3
Mol. Mass.344.204
SMILESCC(C)C[C@H](NC(=O)Nc1ccccc1Br)C(=O)NO