Reaction Details
TargetAndrogen receptor
LigandBDBM18525
Substrate/Competitorn/a
Meas. Tech.ChEMBL_942992 (CHEMBL2343828)
IC50 3000±n/a nM
Citation Nakamura, MMakishima, MHashimoto, Y Development of silicon-containing bis-phenol derivatives as androgen receptor antagonists: selectivity switching by C/Si exchange. Bioorg Med Chem21:1643-51 (2013) 
 
Androgen receptor
Name:Androgen receptor
Type:PROTEIN
Mol. Mass.:98196.62
Organism:Mus musculus
Description:ChEMBL_945930
Residue:899
BDBM18525
NameBDBM18525
Synonyms:Bicalutamide N-[4-cyano-3-(trifluoromethyl)phenyl]-3-[(4-fluorobenzene)sulfonyl]-2-hydroxy-2-methylpropanamide US20230382870, Bicalutumide US9682960, CAS
TypeSmall organic molecule
Emp. Form.C18H14F4N2O4S
Mol. Mass.430.373
SMILESCC(O)(CS(=O)(=O)c1ccc(F)cc1)C(=O)Nc1ccc(C#N)c(c1)C(F)(F)F