Reaction Details
TargetDelta-type opioid receptor
LigandBDBM50430806
Substrate/Competitorn/a
Meas. Tech.ChEMBL_943437 (CHEMBL2341881)
Ki 2780±n/a nM
Citation Liu, XWang, YXing, YYu, JJi, HKai, MWang, ZWang, DZhang, YZhao, DWang, R Design, synthesis, and pharmacological characterization of novel endomorphin-1 analogues as extremely potentµ-opioid agonists. J Med Chem56:3102-14 (2013) 
 
Delta-type opioid receptor
Name:Delta-type opioid receptor
Type:G Protein-Coupled Receptor (GPCR)
Mol. Mass.:40382.98
Organism:Homo sapiens (Human)
Description:Competition binding assays were carried out using membrane preparations from transfected HN9.10 cells that constitutively expressed the delta opioid receptor.
Residue:372
BDBM50430806
NameBDBM50430806
Synonyms:CHEMBL2334771
TypeSmall organic molecule
Emp. Form.C33H36N6O6
Mol. Mass.612.6755
SMILESN[C@@H](Cc1ccc(O)cc1)C(=O)N1CC[C@H](C1)C(=O)N[C@@H](Cc1c[nH]c2ccccc12)C(=O)N[C@H](C(=C)C(N)=O)c1ccco1