Reaction Details
TargetMu-type opioid receptor
LigandBDBM50430799
Substrate/Competitorn/a
Meas. Tech.ChEMBL_943433 (CHEMBL2341877)
IC50 0.467000±n/a nM
Citation Liu, XWang, YXing, YYu, JJi, HKai, MWang, ZWang, DZhang, YZhao, DWang, R Design, synthesis, and pharmacological characterization of novel endomorphin-1 analogues as extremely potentµ-opioid agonists. J Med Chem56:3102-14 (2013) 
 
Mu-type opioid receptor
Name:Mu-type opioid receptor
Type:Enzyme Catalytic Domain
Mol. Mass.:11165.58
Organism:GUINEA PIG
Description:P97266
Residue:98
BDBM50430799
NameBDBM50430799
Synonyms:CHEMBL2334772
TypeSmall organic molecule
Emp. Form.C37H41N5O6
Mol. Mass.651.7513
SMILESCc1cc(O)cc(C)c1C[C@H](N)C(=O)N1CCC[C@H]1C(=O)N[C@@H](Cc1c[nH]c2ccccc12)C(=O)N[C@H](C(=C)C(O)=O)c1ccccc1