Reaction Details
TargetMu-type opioid receptor
LigandBDBM50430802
Substrate/Competitorn/a
Meas. Tech.ChEMBL_943438 (CHEMBL2341882)
Ki 0.012800±n/a nM
Citation Liu, XWang, YXing, YYu, JJi, HKai, MWang, ZWang, DZhang, YZhao, DWang, R Design, synthesis, and pharmacological characterization of novel endomorphin-1 analogues as extremely potentµ-opioid agonists. J Med Chem56:3102-14 (2013) 
 
Mu-type opioid receptor
Name:Mu-type opioid receptor
Type:G Protein-Coupled Receptor (GPCR)
Mol. Mass.:44789.51
Organism:Homo sapiens (Human)
Description:P35372
Residue:400
BDBM50430802
NameBDBM50430802
Synonyms:CHEMBL2334775
TypeSmall organic molecule
Emp. Form.C35H40N6O6
Mol. Mass.640.7287
SMILESCc1cc(O)cc(C)c1C[C@H](N)C(=O)N1CC[C@@H](C1)C(=O)N[C@@H](Cc1c[nH]c2ccccc12)C(=O)N[C@H](C(=C)C(N)=O)c1ccco1