Reaction Details
TargetcAMP and cAMP-inhibited cGMP 3',5'-cyclic phosphodiesterase 10A
LigandBDBM50430809
Substrate/Competitorn/a
Meas. Tech.ChEMBL_943440 (CHEMBL2341884)
Kd 12000±n/a nM
Citation Geschwindner, SDekker, NHorsefield, RTigerström, AJohansson, PScott, CWAlbert, JS Development of a plate-based optical biosensor fragment screening methodology to identify phosphodiesterase 10A inhibitors. J Med Chem56:3228-34 (2013) 
 
cAMP and cAMP-inhibited cGMP 3',5'-cyclic phosphodiesterase 10A
Name:cAMP and cAMP-inhibited cGMP 3',5'-cyclic phosphodiesterase 10A
Type:Protein
Mol. Mass.:88412.52
Organism:Homo sapiens (Human)
Description:Q9Y233
Residue:779
BDBM50430809
NameBDBM50430809
Synonyms:CHEMBL2335132
TypeSmall organic molecule
Emp. Form.C16H11NO3
Mol. Mass.265.2634
SMILESOc1cc(nc2ccccc12)-c1ccc2OCOc2c1