Reaction Details
TargetcAMP and cAMP-inhibited cGMP 3',5'-cyclic phosphodiesterase 10A
LigandBDBM50430812
Substrate/Competitorn/a
Meas. Tech.ChEMBL_943440 (CHEMBL2341884)
Kd 19000±n/a nM
Citation Geschwindner, SDekker, NHorsefield, RTigerström, AJohansson, PScott, CWAlbert, JS Development of a plate-based optical biosensor fragment screening methodology to identify phosphodiesterase 10A inhibitors. J Med Chem56:3228-34 (2013) 
 
cAMP and cAMP-inhibited cGMP 3',5'-cyclic phosphodiesterase 10A
Name:cAMP and cAMP-inhibited cGMP 3',5'-cyclic phosphodiesterase 10A
Type:Protein
Mol. Mass.:88412.52
Organism:Homo sapiens (Human)
Description:Q9Y233
Residue:779
BDBM50430812
NameBDBM50430812
Synonyms:CHEMBL2335130
TypeSmall organic molecule
Emp. Form.C15H11ClN2O
Mol. Mass.270.714
SMILESNc1ccc2nc(cc(O)c2c1)-c1ccc(Cl)cc1