Reaction Details
TargetEpithelial discoidin domain-containing receptor 1
LigandBDBM50430857
Substrate/Competitorn/a
Meas. Tech.ChEMBL_945426 (CHEMBL2342537)
IC50 6.1±n/a nM
Citation Gao, MDuan, LLuo, JZhang, LLu, XZhang, YZhang, ZTu, ZXu, YRen, XDing, K Discovery and optimization of 3-(2-(Pyrazolo[1,5-a]pyrimidin-6-yl)ethynyl)benzamides as novel selective and orally bioavailable discoidin domain receptor 1 (DDR1) inhibitors. J Med Chem56:3281-95 (2013) 
 
Epithelial discoidin domain-containing receptor 1
Name:Epithelial discoidin domain-containing receptor 1
Type:Tyrosine-protein kinase
Mol. Mass.:101130.02
Organism:Homo sapiens (Human)
Description:Q08345
Residue:913
BDBM50430857
NameBDBM50430857
Synonyms:CHEMBL2336021
TypeSmall organic molecule
Emp. Form.C23H15F3N4O
Mol. Mass.420.3866
SMILESCc1ccc(cc1C#Cc1cnc2ccnn2c1)C(=O)Nc1cccc(c1)C(F)(F)F