Reaction Details
TargetHistone deacetylase 6
LigandBDBM50430971
Substrate/Competitorn/a
Meas. Tech.ChEMBL_947308 (CHEMBL2343614)
IC50 681±n/a nM
Citation Patil, VSodji, QHKornacki, JRMrksich, MOyelere, AK 3-Hydroxypyridin-2-thione as novel zinc binding group for selective histone deacetylase inhibition. J Med Chem56:3492-506 (2013) 
 
Histone deacetylase 6
Name:Histone deacetylase 6
Type:Chromatin regulator; hydrolase; repressor
Mol. Mass.:131381.51
Organism:Homo sapiens (Human)
Description:Q9UBN7
Residue:1215
BDBM50430971
NameBDBM50430971
Synonyms:CHEMBL2337874
TypeSmall organic molecule
Emp. Form.C5H5NOS
Mol. Mass.127.164
SMILESOc1ccc[nH]c1=S