Reaction Details
TargetHistone deacetylase 8
LigandBDBM50430977
Substrate/Competitorn/a
Meas. Tech.ChEMBL_947306 (CHEMBL2343612)
IC50 800±n/a nM
Citation Patil, VSodji, QHKornacki, JRMrksich, MOyelere, AK 3-Hydroxypyridin-2-thione as novel zinc binding group for selective histone deacetylase inhibition. J Med Chem56:3492-506 (2013) 
 
Histone deacetylase 8
Name:Histone deacetylase 8
Type:Enzyme
Mol. Mass.:41749.60
Organism:Homo sapiens (Human)
Description:Q9BY41
Residue:377
BDBM50430977
NameBDBM50430977
Synonyms:CHEMBL2337869
TypeSmall organic molecule
Emp. Form.C19H17NOS
Mol. Mass.307.409
SMILESCc1ccc(cc1)-c1ccc(Cn2cccc(O)c2=S)cc1