Reaction Details
TargetAlpha-ketoglutarate-dependent dioxygenase FTO
LigandBDBM19473
Substrate/Competitorn/a
Meas. Tech.ChEMBL_947323 (CHEMBL2344107)
IC50>1000000±n/a nM
Citation Aik, WDemetriades, MHamdan, MKBagg, EAYeoh, KKLejeune, CZhang, ZMcDonough, MASchofield, CJ Structural basis for inhibition of the fat mass and obesity associated protein (FTO). J Med Chem56:3680-8 (2013) 
 
Alpha-ketoglutarate-dependent dioxygenase FTO
Name:Alpha-ketoglutarate-dependent dioxygenase FTO
Type:PROTEIN
Mol. Mass.:58263.75
Organism:Homo sapiens (Human)
Description:ChEMBL_1515854
Residue:505
BDBM19473
NameBDBM19473
Synonyms:2-Oxopropanoate Pyruvate
TypeSmall organic molecule
Emp. Form.C3H4O3
Mol. Mass.88.0621
SMILESCC(=O)C(O)=O