Reaction Details
TargetAlpha-ketoglutarate-dependent dioxygenase FTO
LigandBDBM26431
Substrate/Competitorn/a
Meas. Tech.ChEMBL_947323 (CHEMBL2344107)
IC50>1000000±n/a nM
Citation Aik, WDemetriades, MHamdan, MKBagg, EAYeoh, KKLejeune, CZhang, ZMcDonough, MASchofield, CJ Structural basis for inhibition of the fat mass and obesity associated protein (FTO). J Med Chem56:3680-8 (2013) 
 
Alpha-ketoglutarate-dependent dioxygenase FTO
Name:Alpha-ketoglutarate-dependent dioxygenase FTO
Type:PROTEIN
Mol. Mass.:58263.75
Organism:Homo sapiens (Human)
Description:ChEMBL_1515854
Residue:505
BDBM26431
NameBDBM26431
Synonyms:(2R)-2-aminopentanedioic acid D-Glu D-[14C]Glu
Typeradiolabeled amino acid
Emp. Form.C5H9NO4
Mol. Mass.147.1293
SMILESN[C@H](CCC(O)=O)C(O)=O