Reaction Details
TargetAlpha-ketoglutarate-dependent dioxygenase FTO
LigandBDBM26122
Substrate/Competitorn/a
Meas. Tech.ChEMBL_947323 (CHEMBL2344107)
IC50 150000±n/a nM
Citation Aik, WDemetriades, MHamdan, MKBagg, EAYeoh, KKLejeune, CZhang, ZMcDonough, MASchofield, CJ Structural basis for inhibition of the fat mass and obesity associated protein (FTO). J Med Chem56:3680-8 (2013) 
 
Alpha-ketoglutarate-dependent dioxygenase FTO
Name:Alpha-ketoglutarate-dependent dioxygenase FTO
Type:PROTEIN
Mol. Mass.:58263.75
Organism:Homo sapiens (Human)
Description:ChEMBL_1515854
Residue:505
BDBM26122
NameBDBM26122
Synonyms:(2E)-but-2-enedioic acid Fumarate | fumarate, 10
TypeSmall organic molecule
Emp. Form.C4H4O4
Mol. Mass.116.0722
SMILESOC(=O)\C=C\C(O)=O