Reaction Details
TargetAlpha-ketoglutarate-dependent dioxygenase FTO
LigandBDBM50431015
Substrate/Competitorn/a
Meas. Tech.ChEMBL_947323 (CHEMBL2344107)
IC50 9800±n/a nM
Citation Aik, WDemetriades, MHamdan, MKBagg, EAYeoh, KKLejeune, CZhang, ZMcDonough, MASchofield, CJ Structural basis for inhibition of the fat mass and obesity associated protein (FTO). J Med Chem56:3680-8 (2013) 
 
Alpha-ketoglutarate-dependent dioxygenase FTO
Name:Alpha-ketoglutarate-dependent dioxygenase FTO
Type:PROTEIN
Mol. Mass.:58263.75
Organism:Homo sapiens (Human)
Description:ChEMBL_1515854
Residue:505
BDBM50431015
NameBDBM50431015
Synonyms:CHEMBL2338329 US9115085, Compound A Form A | US9340511, 3
TypeSmall organic molecule
Emp. Form.C19H16N2O5
Mol. Mass.352.3407
SMILESCc1nc(C(=O)NCC(O)=O)c(O)c2ccc(Oc3ccccc3)cc12