Reaction Details
TargetAlpha-ketoglutarate-dependent dioxygenase FTO
LigandBDBM50431023
Substrate/Competitorn/a
Meas. Tech.ChEMBL_947323 (CHEMBL2344107)
IC50 23000±n/a nM
Citation Aik, WDemetriades, MHamdan, MKBagg, EAYeoh, KKLejeune, CZhang, ZMcDonough, MASchofield, CJ Structural basis for inhibition of the fat mass and obesity associated protein (FTO). J Med Chem56:3680-8 (2013) 
 
Alpha-ketoglutarate-dependent dioxygenase FTO
Name:Alpha-ketoglutarate-dependent dioxygenase FTO
Type:PROTEIN
Mol. Mass.:58263.75
Organism:Homo sapiens (Human)
Description:ChEMBL_1515854
Residue:505
BDBM50431023
NameBDBM50431023
Synonyms:CHEMBL2338322
TypeSmall organic molecule
Emp. Form.C9H8N2O3S
Mol. Mass.224.236
SMILESNS(=O)(=O)c1ccc(O)c2ncccc12