Reaction Details
TargetAlpha-ketoglutarate-dependent dioxygenase FTO
LigandBDBM50396018
Substrate/Competitorn/a
Meas. Tech.ChEMBL_947323 (CHEMBL2344107)
IC50 3300±n/a nM
Citation Aik, WDemetriades, MHamdan, MKBagg, EAYeoh, KKLejeune, CZhang, ZMcDonough, MASchofield, CJ Structural basis for inhibition of the fat mass and obesity associated protein (FTO). J Med Chem56:3680-8 (2013) 
 
Alpha-ketoglutarate-dependent dioxygenase FTO
Name:Alpha-ketoglutarate-dependent dioxygenase FTO
Type:PROTEIN
Mol. Mass.:58263.75
Organism:Homo sapiens (Human)
Description:ChEMBL_1515854
Residue:505
BDBM50396018
NameBDBM50396018
Synonyms:CHEMBL1230640
TypeSmall organic molecule
Emp. Form.C10H7NO3
Mol. Mass.189.1675
SMILESOC(=O)c1ccc(O)c2ncccc12