Reaction Details
TargetMAP kinase-activated protein kinase 2
LigandBDBM50431025
Substrate/Competitorn/a
Meas. Tech.ChEMBL_947327 (CHEMBL2344111)
IC50>100000±n/a nM
Citation Brown, AShi, QMoore, TWYoon, YPrussia, AMaddox, CLiotta, DCShim, HSnyder, JP Monocarbonyl curcumin analogues: heterocyclic pleiotropic kinase inhibitors that mediate anticancer properties. J Med Chem56:3456-66 (2013) 
 
MAP kinase-activated protein kinase 2
Name:MAP kinase-activated protein kinase 2
Type:Serine/threonine-protein kinase
Mol. Mass.:45579.87
Organism:Homo sapiens (Human)
Description:P49137
Residue:400
BDBM50431025
NameBDBM50431025
Synonyms:CHEMBL2338335
TypeSmall organic molecule
Emp. Form.C18H19N3O
Mol. Mass.293.363
SMILESCN1C[C@H](Cc2ccccn2)C(=O)C(C1)=Cc1ccccn1