Reaction Details
TargetMitogen-activated protein kinase 1
LigandBDBM50431025
Substrate/Competitorn/a
Meas. Tech.ChEMBL_947333 (CHEMBL2344117)
IC50>100000±n/a nM
Citation Brown, AShi, QMoore, TWYoon, YPrussia, AMaddox, CLiotta, DCShim, HSnyder, JP Monocarbonyl curcumin analogues: heterocyclic pleiotropic kinase inhibitors that mediate anticancer properties. J Med Chem56:3456-66 (2013) 
 
Mitogen-activated protein kinase 1
Name:Mitogen-activated protein kinase 1
Type:Ser/Thr Protein Kinase
Mol. Mass.:41392.76
Organism:Homo sapiens (Human)
Description:P28482
Residue:360
BDBM50431025
NameBDBM50431025
Synonyms:CHEMBL2338335
TypeSmall organic molecule
Emp. Form.C18H19N3O
Mol. Mass.293.363
SMILESCN1C[C@H](Cc2ccccn2)C(=O)C(C1)=Cc1ccccn1