Reaction Details
TargetDual specificity mitogen-activated protein kinase kinase 1
LigandBDBM50431025
Substrate/Competitorn/a
Meas. Tech.ChEMBL_947332 (CHEMBL2344116)
IC50>100000±n/a nM
Citation Brown, AShi, QMoore, TWYoon, YPrussia, AMaddox, CLiotta, DCShim, HSnyder, JP Monocarbonyl curcumin analogues: heterocyclic pleiotropic kinase inhibitors that mediate anticancer properties. J Med Chem56:3456-66 (2013) 
 
Dual specificity mitogen-activated protein kinase kinase 1
Name:Dual specificity mitogen-activated protein kinase kinase 1
Type:Other Protein Type
Mol. Mass.:43439.03
Organism:Homo sapiens (Human)
Description:Full-length human MEK-1 was generated by PCR and purified as a fusion protein from Escherichia coli lysates.
Residue:393
BDBM50431025
NameBDBM50431025
Synonyms:CHEMBL2338335
TypeSmall organic molecule
Emp. Form.C18H19N3O
Mol. Mass.293.363
SMILESCN1C[C@H](Cc2ccccn2)C(=O)C(C1)=Cc1ccccn1