Reaction Details
TargetRAF proto-oncogene serine/threonine-protein kinase
LigandBDBM50431026
Substrate/Competitorn/a
Meas. Tech.ChEMBL_947334 (CHEMBL2344118)
IC50>100000±n/a nM
Citation Brown, AShi, QMoore, TWYoon, YPrussia, AMaddox, CLiotta, DCShim, HSnyder, JP Monocarbonyl curcumin analogues: heterocyclic pleiotropic kinase inhibitors that mediate anticancer properties. J Med Chem56:3456-66 (2013) 
 
RAF proto-oncogene serine/threonine-protein kinase
Name:RAF proto-oncogene serine/threonine-protein kinase
Type:Serine/threonine-protein kinase
Mol. Mass.:73082.52
Organism:Homo sapiens (Human)
Description:P04049
Residue:648
BDBM50431026
NameBDBM50431026
Synonyms:CHEMBL2338334
TypeSmall organic molecule
Emp. Form.C18H19N3O
Mol. Mass.293.363
SMILESCN1C[C@@H](Cc2ccccn2)C(=O)C(C1)=Cc1ccccn1