Reaction Details
TargetMAP kinase-activated protein kinase 2
LigandBDBM50431027
Substrate/Competitorn/a
Meas. Tech.ChEMBL_947327 (CHEMBL2344111)
IC50 16000±n/a nM
Citation Brown, AShi, QMoore, TWYoon, YPrussia, AMaddox, CLiotta, DCShim, HSnyder, JP Monocarbonyl curcumin analogues: heterocyclic pleiotropic kinase inhibitors that mediate anticancer properties. J Med Chem56:3456-66 (2013) 
 
MAP kinase-activated protein kinase 2
Name:MAP kinase-activated protein kinase 2
Type:Serine/threonine-protein kinase
Mol. Mass.:45579.87
Organism:Homo sapiens (Human)
Description:P49137
Residue:400
BDBM50431027
NameBDBM50431027
Synonyms:CHEMBL2036343
TypeSmall organic molecule
Emp. Form.C17H14N2OS
Mol. Mass.294.371
SMILESO=C1\C(CSC\C1=C/c1ccccn1)=C\c1ccccn1