Reaction Details
TargetRibosomal protein S6 kinase beta-1
LigandBDBM50431027
Substrate/Competitorn/a
Meas. Tech.ChEMBL_947336 (CHEMBL2344120)
IC50 12000±n/a nM
Citation Brown, AShi, QMoore, TWYoon, YPrussia, AMaddox, CLiotta, DCShim, HSnyder, JP Monocarbonyl curcumin analogues: heterocyclic pleiotropic kinase inhibitors that mediate anticancer properties. J Med Chem56:3456-66 (2013) 
 
Ribosomal protein S6 kinase beta-1
Name:Ribosomal protein S6 kinase beta-1
Type:Enzyme
Mol. Mass.:59139.89
Organism:Homo sapiens (Human)
Description:His-tagged S6K1.
Residue:525
BDBM50431027
NameBDBM50431027
Synonyms:CHEMBL2036343
TypeSmall organic molecule
Emp. Form.C17H14N2OS
Mol. Mass.294.371
SMILESO=C1\C(CSC\C1=C/c1ccccn1)=C\c1ccccn1