Reaction Details
TargetRAC-alpha serine/threonine-protein kinase
LigandBDBM50431027
Substrate/Competitorn/a
Meas. Tech.ChEMBL_947340 (CHEMBL2344124)
IC50 3600±n/a nM
Citation Brown, AShi, QMoore, TWYoon, YPrussia, AMaddox, CLiotta, DCShim, HSnyder, JP Monocarbonyl curcumin analogues: heterocyclic pleiotropic kinase inhibitors that mediate anticancer properties. J Med Chem56:3456-66 (2013) 
 
RAC-alpha serine/threonine-protein kinase
Name:RAC-alpha serine/threonine-protein kinase
Type:Enzyme
Mol. Mass.:55681.25
Organism:Homo sapiens (Human)
Description:P31749
Residue:480
BDBM50431027
NameBDBM50431027
Synonyms:CHEMBL2036343
TypeSmall organic molecule
Emp. Form.C17H14N2OS
Mol. Mass.294.371
SMILESO=C1\C(CSC\C1=C/c1ccccn1)=C\c1ccccn1