Reaction Details
TargetMitogen-activated protein kinase 1
LigandBDBM50431028
Substrate/Competitorn/a
Meas. Tech.ChEMBL_947333 (CHEMBL2344117)
IC50 27000±n/a nM
Citation Brown, AShi, QMoore, TWYoon, YPrussia, AMaddox, CLiotta, DCShim, HSnyder, JP Monocarbonyl curcumin analogues: heterocyclic pleiotropic kinase inhibitors that mediate anticancer properties. J Med Chem56:3456-66 (2013) 
 
Mitogen-activated protein kinase 1
Name:Mitogen-activated protein kinase 1
Type:Ser/Thr Protein Kinase
Mol. Mass.:41392.76
Organism:Homo sapiens (Human)
Description:P28482
Residue:360
BDBM50431028
NameBDBM50431028
Synonyms:CHEMBL2338333
TypeSmall organic molecule
Emp. Form.C18H17N3O
Mol. Mass.291.3471
SMILESCN1C\C(=C/c2ccccn2)C(=O)\C(C1)=C\c1ccccn1