Reaction Details
TargetMitogen-activated protein kinase 1
LigandBDBM50431030
Substrate/Competitorn/a
Meas. Tech.ChEMBL_947333 (CHEMBL2344117)
IC50 13000±n/a nM
Citation Brown, AShi, QMoore, TWYoon, YPrussia, AMaddox, CLiotta, DCShim, HSnyder, JP Monocarbonyl curcumin analogues: heterocyclic pleiotropic kinase inhibitors that mediate anticancer properties. J Med Chem56:3456-66 (2013) 
 
Mitogen-activated protein kinase 1
Name:Mitogen-activated protein kinase 1
Type:Ser/Thr Protein Kinase
Mol. Mass.:41392.76
Organism:Homo sapiens (Human)
Description:P28482
Residue:360
BDBM50431030
NameBDBM50431030
Synonyms:CHEMBL379849
TypeSmall organic molecule
Emp. Form.C19H15F2NO
Mol. Mass.311.3253
SMILESFc1ccccc1\C=C1/CNC\C(=C/c2ccccc2F)C1=O