Reaction Details
TargetD-amino-acid oxidase
LigandBDBM50431078
Substrate/Competitorn/a
Meas. Tech.ChEMBL_947856 (CHEMBL2343132)
IC50 2.4±n/a nM
Citation Hondo, TWarizaya, MNiimi, TNamatame, IYamaguchi, TNakanishi, KHamajima, THarada, KSakashita, HMatsumoto, YOrita, MTakeuchi, M 4-Hydroxypyridazin-3(2H)-one derivatives as novel D-amino acid oxidase inhibitors. J Med Chem56:3582-92 (2013) 
 
D-amino-acid oxidase
Name:D-amino-acid oxidase
Type:Homodimer
Mol. Mass.:39476.06
Organism:Homo sapiens (Human)
Description:P14920
Residue:347
BDBM50431078
NameBDBM50431078
Synonyms:CHEMBL2338786 US11129828, Example 1 US9931340, Example 1
TypeSmall organic molecule
Emp. Form.C12H12N2O2
Mol. Mass.216.2359
SMILESOc1cc(CCc2ccccc2)n[nH]c1=O