Reaction Details
TargetD-amino-acid oxidase
LigandBDBM31148
Substrate/Competitorn/a
Meas. Tech.ChEMBL_947859 (CHEMBL2343135)
IC50 6.9±n/a nM
Citation Hondo, TWarizaya, MNiimi, TNamatame, IYamaguchi, TNakanishi, KHamajima, THarada, KSakashita, HMatsumoto, YOrita, MTakeuchi, M 4-Hydroxypyridazin-3(2H)-one derivatives as novel D-amino acid oxidase inhibitors. J Med Chem56:3582-92 (2013) 
 
D-amino-acid oxidase
Name:D-amino-acid oxidase
Type:Homodimer
Mol. Mass.:39476.06
Organism:Homo sapiens (Human)
Description:P14920
Residue:347
BDBM31148
NameBDBM31148
Synonyms:3-hydroxyquinolin-2(1H)-one, 2 | US9701638, 1
TypeSmall organic molecule
Emp. Form.C9H7NO2
Mol. Mass.161.1574
SMILESOc1cc2ccccc2[nH]c1=O