Reaction Details
TargetD-amino-acid oxidase
LigandBDBM50431067
Substrate/Competitorn/a
Meas. Tech.ChEMBL_947854 (CHEMBL2343130)
IC50 2.6±n/a nM
Citation Hondo, TWarizaya, MNiimi, TNamatame, IYamaguchi, TNakanishi, KHamajima, THarada, KSakashita, HMatsumoto, YOrita, MTakeuchi, M 4-Hydroxypyridazin-3(2H)-one derivatives as novel D-amino acid oxidase inhibitors. J Med Chem56:3582-92 (2013) 
 
D-amino-acid oxidase
Name:D-amino-acid oxidase
Type:Homodimer
Mol. Mass.:38824.91
Organism:Rattus norvegicus (rat)
Description:Recombinant rat DAAO expressed and purified from sf9 insect cells, was used in enzyme assays.
Residue:346
BDBM50431067
NameBDBM50431067
Synonyms:CHEMBL2338797 US10463663, Example 6 US9212147, 18 US9931340, Example 6
TypeSmall organic molecule
Emp. Form.C12H11FN2O2
Mol. Mass.234.2263
SMILESOc1cc(CCc2cccc(F)c2)n[nH]c1=O