Reaction Details
TargetD-amino-acid oxidase
LigandBDBM50431074
Substrate/Competitorn/a
Meas. Tech.ChEMBL_947855 (CHEMBL2343131)
IC50 1.9±n/a nM
Citation Hondo, TWarizaya, MNiimi, TNamatame, IYamaguchi, TNakanishi, KHamajima, THarada, KSakashita, HMatsumoto, YOrita, MTakeuchi, M 4-Hydroxypyridazin-3(2H)-one derivatives as novel D-amino acid oxidase inhibitors. J Med Chem56:3582-92 (2013) 
 
D-amino-acid oxidase
Name:D-amino-acid oxidase
Type:PROTEIN
Mol. Mass.:38667.41
Organism:Mus musculus
Description:ChEMBL_947855
Residue:345
BDBM50431074
NameBDBM50431074
Synonyms:CHEMBL2338790 US11129828, Example 27 US9290456, 27 | US9931340, Example 27
TypeSmall organic molecule
Emp. Form.C12H11ClN2O2
Mol. Mass.250.681
SMILESOc1cc(CCc2ccc(Cl)cc2)n[nH]c1=O