Reaction Details
TargetD-amino-acid oxidase
LigandBDBM50431077
Substrate/Competitorn/a
Meas. Tech.ChEMBL_947855 (CHEMBL2343131)
IC50 2.8±n/a nM
Citation Hondo, TWarizaya, MNiimi, TNamatame, IYamaguchi, TNakanishi, KHamajima, THarada, KSakashita, HMatsumoto, YOrita, MTakeuchi, M 4-Hydroxypyridazin-3(2H)-one derivatives as novel D-amino acid oxidase inhibitors. J Med Chem56:3582-92 (2013) 
 
D-amino-acid oxidase
Name:D-amino-acid oxidase
Type:PROTEIN
Mol. Mass.:38667.41
Organism:Mus musculus
Description:ChEMBL_947855
Residue:345
BDBM50431077
NameBDBM50431077
Synonyms:CHEMBL2338787 US10463663, Example 56 US9212147, 48 US9931340, Example 56
TypeSmall organic molecule
Emp. Form.C12H12N2O2
Mol. Mass.216.2359
SMILESCC(c1ccccc1)c1cc(O)c(=O)[nH]n1