Reaction Details
TargetNAD-dependent protein deacetylase sirtuin-1
LigandBDBM50431089
Substrate/Competitorn/a
Meas. Tech.ChEMBL_948318 (CHEMBL2341152)
IC50 53±n/a nM
Citation Disch, JSEvindar, GChiu, CHBlum, CADai, HJin, LSchuman, ELind, KEBelyanskaya, SLDeng, JCoppo, FAquilani, LGraybill, TLCuozzo, JWLavu, SMao, CVlasuk, GPPerni, RB Discovery of thieno[3,2-d]pyrimidine-6-carboxamides as potent inhibitors of SIRT1, SIRT2, and SIRT3. J Med Chem56:3666-79 (2013) 
 
NAD-dependent protein deacetylase sirtuin-1
Name:NAD-dependent protein deacetylase sirtuin-1
Type:Developmental protein; hydrolase
Mol. Mass.:81626.66
Organism:Homo sapiens (Human)
Description:n/a
Residue:747
BDBM50431089
NameBDBM50431089
Synonyms:CHEMBL2338814
TypeSmall organic molecule
Emp. Form.C17H24N6OS
Mol. Mass.360.477
SMILESNC(=O)c1cc2ncnc(N3CCN(CCN4CCCC4)CC3)c2s1