Reaction Details
TargetNAD-dependent protein deacetylase sirtuin-3, mitochondrial
LigandBDBM50431093
Substrate/Competitorn/a
Meas. Tech.ChEMBL_948316 (CHEMBL2340697)
IC50 7.2±n/a nM
Citation Disch, JSEvindar, GChiu, CHBlum, CADai, HJin, LSchuman, ELind, KEBelyanskaya, SLDeng, JCoppo, FAquilani, LGraybill, TLCuozzo, JWLavu, SMao, CVlasuk, GPPerni, RB Discovery of thieno[3,2-d]pyrimidine-6-carboxamides as potent inhibitors of SIRT1, SIRT2, and SIRT3. J Med Chem56:3666-79 (2013) 
 
NAD-dependent protein deacetylase sirtuin-3, mitochondrial
Name:NAD-dependent protein deacetylase sirtuin-3, mitochondrial
Type:Protein
Mol. Mass.:43582.69
Organism:Homo sapiens (Human)
Description:Q9NTG7
Residue:399
BDBM50431093
NameBDBM50431093
Synonyms:CHEMBL2338810
TypeSmall organic molecule
Emp. Form.C15H21N5O3S2
Mol. Mass.383.489
SMILESCS(=O)(=O)NCCC1CCN(CC1)c1ncnc2cc(sc12)C(N)=O